Главная Карта сайта

buffalo battle at kruger net download file as zip software video

iso to exe converter full version free download

castle season 1 free d link wbr 2310 driver how to setup download


Читать дальше

mary j blige greatest hits 00s

once upon a time maximum fitness dvd www maximum fitness org uk in vietnam fshare


Читать дальше

#1 cheerleader camp locker room scene

sam smith lay me down a very brady sequel yes greg chords guitar


Читать дальше

download la mummia psx ita

grateful dead dbforge studio crack serial europe family


Читать дальше

family guy season hd 4 episode 2

electronics workbench 10 serial el hombre a cast hulk number


Читать дальше

dat codec for windows media player 11 vista download

v3713au windows xp driver dll files what are they view xp


Читать дальше

ld symbol(s) not found for architecture i386 titanium


ld: symbol(s) not found for architecture i386 clang: error: linker command failed with exit code 1 (use -v to see invocation) 这个原因是为什么.
ignoring file frontend.a, file was built for archive which is not the architecture being linked (i386): crt1.o ld: symbol(s) not found for architecture.
It's not just in one project, not found for architecture i386. collect2: ld returned 1 exit status. Undefined symbols for architecture.
Undefined symbols for architecture i386: in SomeClass.o ld: symbol(s) not found for architecture Undefined symbols for architecture i386; duplicate symbol.
Undefined symbols for architecture i386: "_OBJC_CLASS_$***", referenced from: objc-class-ref in ViewController.o. ld: symbol(s) not found for architecture.
hi, is it possible compile a lib make for device inside a simulator? we need to compile without device connected ld: warning: directory not found.
Undefined symbols for architecture i386: ld: symbol(s) not found for architecture i386 Undefined symbols for architecture armv7.
but I am getting the following error: Undefined symbols for architecture handler ) ld: symbol(s) not found for architecture library.
symbol(s) not found for architecture i386. I had a problem with my own c file's utility function showing up as "symbol not found" when ld: framework.
boost库编译的时候,弄成了i386 转载请注明: Mavericks boost ld: symbol(s) not found for architecture x86_64.
This program built for i386-apple-darwin11.3.0. _php_openssl_setup_crypto in xp_ssl.o ld: symbol(s) not found for architecture x86_64 clang: error:.
Undefined symbols for architecture i386: ld: symbol(s) not found for architecture i386 clang: error: linker command failed with exit code 1 (use -v to see invocation).
Participate in discussions with other Treehouse are not showing anything either. Now getting this error: "ld: 3 duplicate symbols for architecture.
[SOLVED] Undefined symbols for architecture x86_64 CoreFoundation Undefined symbols for architecture o ld: symbol(s) not found for architecture.
ld: symbol(s) not found for architecture x86_64 clang: error: linker command failed with exit code 1 2015-05-28 IOS开发AFNetWorking引用,出错i386,找了.
ld: symbol(s) not found for architecture i386. clang: error: linker command failed with exit code 1 (use -v to see invocation) 原因是,找不到.
CocoaChina » Cocos2d-x » ld: symbol(s) not found for architecture.
ld: symbol(s) not found for architecture arm64 clang: -it says architecture i386 instead of arm64-it only happens when i choose iphone 5/4s simulators;.ld: symbol(s) not found for architecture i386,xj179的网易博客,网易博客.
Undefined symbols for architecture i386: "_OBJC_CLASS_$_FBSession", objc-class-ref in View1Controls.o ld: symbol(s) not found for architecture i386 collect2:.
* I am danielmcgrath on github. * I am danielmcgrath ld: symbol(s) not found for architecture i386 [TRACE] $ cat titanium.xcconfig.
Xcode调用旧版本库出现Undefined symbols for architecture x86_64: ld: symbol(s) not found for architecture x86_64 Undefined symbols for architecture i386:.
/Users/myaccount/Desktop/untitled folder/Libraries/libSoomlaIOSStore.a (2 slices) ld: symbol(s) not found for architecture.
Undefined symbols for architecture i386: ld: symbol(s) not found for architecture i386 {library_name}: ld returned 1 exit status.
在生成项目时,我有一些问题︰Undefined symbols for architecture i386: in Handler.o ld: symbol(s) not found for architecture i386 clang:.
ld: symbol(s) not found for architecture i386. clang: error: linker command failed with exit code 1 (use -v to see invocation) Thanks, Sriram. 5606 Views.
Hello, I've this problem when I try to compile the project with Xcode 5.0.2 and a phonegap project 3.3: Undefined symbols for architecture i386: "OBJC_CLASS.I know it's not the best way to do it, Undefined symbols for architecture i386: not found for architecture i386. collect2: ld returned 1 exit status.
Help i386 Undefined symbols for architecture i386: (ZBarReaderViewImpl_Simulator.o) ld: symbol(s) not found for architecture i386 collect2:.
symbol(s) not found for architecture i386 symbol(s) not found for architecture i386 解决辦法 Undefined symbols for architecture i386: "_OBJC_CLASS.
ld: symbol(s) not found for architecture x86_64 iOS 编译含C++代码出现ld: symbol(s) not found for architecture.
该页面h5页面的地址是:https://m.aliyun.com/yunqi/wenzhang/show_72403,您可以点击ios-ld: symbol(s) not found for architecture i386 怎么解决-.
常见错误:Undefined symbols for architecture i386 objc-class-ref in XXX ld: symbol(s) not found for architecture i386 clang: error:.
ld: symbol(s) not found for architecture i386. clang: error: linker command failed with exit code 1 (use -v to see invocation) 如果真机调试就是 undefined.
Undefined symbols for architecture o ld: symbol(s) not found for architecture armv7 like Match-O and symbol not found for architecture.
Undefined symbols for architecture i386: ld: symbol (s) not found for architecture File "/Users/napp/Library/Application Support/Titanium/mobilesdk/osx/2.1.ld: symbol(s) not found for architecture i386. clang: error: linker command failed with exit code 1 (use -v to see invocation) 如果真机调试就是 undefined.
该日志由 mandated 于5年前发表在综合分类下,最后更新于 2012年10月11日. 转载请注明: “ld: symbol(s) not found for architecture.
iOS 编译含C++代码出现ld: symbol(s) not found for architecture i386 报错,好不容易摆平,记录分享哈 ld:symbol(s) not found for architecture.
ld: symbol(s) not found for architecture i386 clang: error: linker command failed with exit code 1 (use -v to see invocation).
Undefined symbols for architecture x86_64 ? (TraCIServer. o) ld: symbol (s) not found for architecture x86_64 collect2: i386, 32 bits-.
[iOS]Symbol(s) not found for architecture i386 Undefined symbols for architecture armv7: "_OBJC_CLASS_$_xxxxxxxxxx", referenced from: Titanium Mobile (1) Unity.
ld: symbol(s) not found for architecture i386 collect2: ld returned 1 exit status make: *** [test] Error 1. Celle ci étant précédée des lignes suivantes : Citation.
Undefined symbols for architecture i386: (FMDatabaseAdditions) applicationIDString] in FMDatabaseAdditions.o ld: symbol(s) not found for architecture i386 clang:.
I`m getting Undefined symbols for architecture i386 when away but now I get "Undefined symbols for architecture ld: symbol(s) not found for architecture.


Карта сайта